Reaction Details
TargetProtein kinase C delta type
LigandBDBM50258820
Substrate/Competitorn/a
Meas. Tech.ChEMBL_523118 (CHEMBL1007476)
IC50 340±n/a nM
Citation Boschelli, DHWang, DPrashad, ASSubrath, JWu, BNiu, CLee, JYang, XBrennan, AChaudhary, D Optimization of 5-phenyl-3-pyridinecarbonitriles as PKCtheta inhibitors. Bioorg Med Chem Lett19:3623-6 (2009) 
 
Protein kinase C delta type
Name:Protein kinase C delta type
Type:Enzyme
Mol. Mass.:77516.79
Organism:Homo sapiens (Human)
Description:The recombinant human PKC enzymes were produced using a baculovirus expression system in SF9 cells
Residue:676
BDBM50258820
NameBDBM50258820
Synonyms:5-(2-methoxyphenyl)-4-(4-methyl-1H-indol-5-ylamino)nicotinonitrile | CHEMBL512606
TypeSmall organic molecule
Emp. Form.C22H18N4O
Mol. Mass.354.4045
SMILESCOc1ccccc1-c1cncc(C#N)c1Nc1ccc2[nH]ccc2c1C