Reaction Details
TargetProtein kinase C delta type
LigandBDBM50258389
Substrate/Competitorn/a
Meas. Tech.ChEMBL_523118 (CHEMBL1007476)
IC50 110±n/a nM
Citation Boschelli, DHWang, DPrashad, ASSubrath, JWu, BNiu, CLee, JYang, XBrennan, AChaudhary, D Optimization of 5-phenyl-3-pyridinecarbonitriles as PKCtheta inhibitors. Bioorg Med Chem Lett19:3623-6 (2009) 
 
Protein kinase C delta type
Name:Protein kinase C delta type
Type:Enzyme
Mol. Mass.:77516.79
Organism:Homo sapiens (Human)
Description:The recombinant human PKC enzymes were produced using a baculovirus expression system in SF9 cells
Residue:676
BDBM50258389
NameBDBM50258389
Synonyms:4-(4-methyl-1H-indol-5-ylamino)-5-(4-(3-(piperazin-1-ylmethylamino)propoxy)phenyl)nicotinonitrile | CHEMBL493825
TypeSmall organic molecule
Emp. Form.C29H32N6O
Mol. Mass.480.604
SMILESCN1CCN(CCCOc2ccc(cc2)-c2cncc(C#N)c2Nc2ccc3[nH]ccc3c2C)CC1