Reaction Details
TargetProtein kinase C zeta type
LigandBDBM50258822
Substrate/Competitorn/a
Meas. Tech.ChEMBL_523123 (CHEMBL1007481)
IC50>100000±n/a nM
Citation Boschelli, DHWang, DPrashad, ASSubrath, JWu, BNiu, CLee, JYang, XBrennan, AChaudhary, D Optimization of 5-phenyl-3-pyridinecarbonitriles as PKCtheta inhibitors. Bioorg Med Chem Lett19:3623-6 (2009) 
 
Protein kinase C zeta type
Name:Protein kinase C zeta type
Type:Enzyme
Mol. Mass.:67649.13
Organism:Homo sapiens (Human)
Description:n/a
Residue:592
BDBM50258822
NameBDBM50258822
Synonyms:4-(4-methyl-1H-indol-5-ylamino)-5-(4-(2-(4-methylpiperazin-1-yl)ethoxy)phenyl)nicotinonitrile | CHEMBL467069
TypeSmall organic molecule
Emp. Form.C28H30N6O
Mol. Mass.466.5774
SMILESCN1CCN(CCOc2ccc(cc2)-c2cncc(C#N)c2Nc2ccc3[nH]ccc3c2C)CC1