Reaction Details
TargetTyrosine-protein kinase Lck
LigandBDBM50258822
Substrate/Competitorn/a
Meas. Tech.ChEMBL_523125 (CHEMBL1007483)
IC50>10000±n/a nM
Citation Boschelli, DHWang, DPrashad, ASSubrath, JWu, BNiu, CLee, JYang, XBrennan, AChaudhary, D Optimization of 5-phenyl-3-pyridinecarbonitriles as PKCtheta inhibitors. Bioorg Med Chem Lett19:3623-6 (2009) 
 
Tyrosine-protein kinase Lck
Name:Tyrosine-protein kinase Lck
Type:n/a
Mol. Mass.:57987.83
Organism:Homo sapiens (Human)
Description:P06239
Residue:509
BDBM50258822
NameBDBM50258822
Synonyms:4-(4-methyl-1H-indol-5-ylamino)-5-(4-(2-(4-methylpiperazin-1-yl)ethoxy)phenyl)nicotinonitrile | CHEMBL467069
TypeSmall organic molecule
Emp. Form.C28H30N6O
Mol. Mass.466.5774
SMILESCN1CCN(CCOc2ccc(cc2)-c2cncc(C#N)c2Nc2ccc3[nH]ccc3c2C)CC1