Reaction Details
TargetMatrix metalloproteinase-9
LigandBDBM50268954
Substrate/Competitorn/a
Meas. Tech.ChEMBL_523765 (CHEMBL1008373)
IC50 577±n/a nM
Citation Burns, DMLi, YLShi, EHe, CXu, MZhuo, JZhang, CQian, DQLi, YWynn, RCovington, MBKatiyar, KMarando, CAFridman, JSScherle, PFriedman, SMetcalf, BYao, W Compelling P1 substituent affect on metalloprotease binding profile enables the design of a novel cyclohexyl core scaffold with excellent MMP selectivity and HER-2 sheddase inhibition. Bioorg Med Chem Lett19:3525-30 (2009) 
 
Matrix metalloproteinase-9
Name:Matrix metalloproteinase-9
Type:Enzyme
Mol. Mass.:78452.28
Organism:Homo sapiens (Human)
Description:P14780
Residue:707
BDBM50268954
NameBDBM50268954
Synonyms:(5S,6S)-N-hydroxy-6-(4-phenylpiperazine-1-carbonyl)spiro[2.5]octane-5-carboxamide | CHEMBL521719
TypeSmall organic molecule
Emp. Form.C20H27N3O3
Mol. Mass.357.4467
SMILESONC(=O)[C@H]1CC2(CC2)CC[C@@H]1C(=O)N1CCN(CC1)c1ccccc1