Reaction Details
TargetReceptor tyrosine-protein kinase erbB-2
LigandBDBM50268904
Substrate/Competitorn/a
Meas. Tech.ChEMBL_523761 (CHEMBL1008369)
IC50 137±n/a nM
Citation Burns, DMLi, YLShi, EHe, CXu, MZhuo, JZhang, CQian, DQLi, YWynn, RCovington, MBKatiyar, KMarando, CAFridman, JSScherle, PFriedman, SMetcalf, BYao, W Compelling P1 substituent affect on metalloprotease binding profile enables the design of a novel cyclohexyl core scaffold with excellent MMP selectivity and HER-2 sheddase inhibition. Bioorg Med Chem Lett19:3525-30 (2009) 
 
Receptor tyrosine-protein kinase erbB-2
Name:Receptor tyrosine-protein kinase erbB-2
Type:n/a
Mol. Mass.:137894.47
Organism:Homo sapiens (Human)
Description:P04626
Residue:1255
BDBM50268904
NameBDBM50268904
Synonyms:CHEMBL445717 | benzyl 5-(2-((3RS,5S,6S)-5-(hydroxycarbamoyl)-6-(3-phenylpyrrolidine-1-carbonyl)piperidin-3-yl)acetamido)pentylcarbamate
TypeSmall organic molecule
Emp. Form.C32H43N5O6
Mol. Mass.593.7137
SMILESONC(=O)[C@H]1CC(CC(=O)NCCCCCNC(=O)OCc2ccccc2)CN[C@@H]1C(=O)N1CCC(C1)c1ccccc1