Reaction Details
TargetReceptor tyrosine-protein kinase erbB-2
LigandBDBM50203529
Substrate/Competitorn/a
Meas. Tech.ChEMBL_523761 (CHEMBL1008369)
IC50 52±n/a nM
Citation Burns, DMLi, YLShi, EHe, CXu, MZhuo, JZhang, CQian, DQLi, YWynn, RCovington, MBKatiyar, KMarando, CAFridman, JSScherle, PFriedman, SMetcalf, BYao, W Compelling P1 substituent affect on metalloprotease binding profile enables the design of a novel cyclohexyl core scaffold with excellent MMP selectivity and HER-2 sheddase inhibition. Bioorg Med Chem Lett19:3525-30 (2009) 
 
Receptor tyrosine-protein kinase erbB-2
Name:Receptor tyrosine-protein kinase erbB-2
Type:n/a
Mol. Mass.:137894.47
Organism:Homo sapiens (Human)
Description:P04626
Residue:1255
BDBM50203529
NameBDBM50203529
Synonyms:(6S,7S)-6-(4-phenyl-piperazine-1-carbonyl)-5-aza-spiro[2.5]octane-7-carboxylic acid hydroxyamide (6S,7S)-N-hydroxy-6-[(4-phenylpiperazin-1-yl)carbonyl]-5-azaspiro[2.5]octane-7-carboxamide | CHEMBL221857
TypeSmall organic molecule
Emp. Form.C19H26N4O3
Mol. Mass.358.4347
SMILESONC(=O)[C@H]1CC2(CC2)CN[C@@H]1C(=O)N1CCN(CC1)c1ccccc1