Reaction Details
TargetDisintegrin and metalloproteinase domain-containing protein 10
LigandBDBM50268905
Substrate/Competitorn/a
Meas. Tech.ChEMBL_523762 (CHEMBL1008370)
IC50 161±n/a nM
Citation Burns, DMLi, YLShi, EHe, CXu, MZhuo, JZhang, CQian, DQLi, YWynn, RCovington, MBKatiyar, KMarando, CAFridman, JSScherle, PFriedman, SMetcalf, BYao, W Compelling P1 substituent affect on metalloprotease binding profile enables the design of a novel cyclohexyl core scaffold with excellent MMP selectivity and HER-2 sheddase inhibition. Bioorg Med Chem Lett19:3525-30 (2009) 
 
Disintegrin and metalloproteinase domain-containing protein 10
Name:Disintegrin and metalloproteinase domain-containing protein 10
Type:Enzyme
Mol. Mass.:84160.93
Organism:Homo sapiens (Human)
Description:O14672
Residue:748
BDBM50268905
NameBDBM50268905
Synonyms:(2S,3S,5RS)-5-(2-(5-aminopentylamino)-2-oxoethyl)-N-hydroxy-2-(3-phenylpyrrolidine-1-carbonyl)piperidine-3-carboxamide | CHEMBL495797
TypeSmall organic molecule
Emp. Form.C24H37N5O4
Mol. Mass.459.5817
SMILESNCCCCCNC(=O)CC1CN[C@@H]([C@H](C1)C(=O)NO)C(=O)N1CCC(C1)c1ccccc1