Reaction Details
TargetDisintegrin and metalloproteinase domain-containing protein 10
LigandBDBM50268954
Substrate/Competitorn/a
Meas. Tech.ChEMBL_523762 (CHEMBL1008370)
IC50 196±n/a nM
Citation Burns, DMLi, YLShi, EHe, CXu, MZhuo, JZhang, CQian, DQLi, YWynn, RCovington, MBKatiyar, KMarando, CAFridman, JSScherle, PFriedman, SMetcalf, BYao, W Compelling P1 substituent affect on metalloprotease binding profile enables the design of a novel cyclohexyl core scaffold with excellent MMP selectivity and HER-2 sheddase inhibition. Bioorg Med Chem Lett19:3525-30 (2009) 
 
Disintegrin and metalloproteinase domain-containing protein 10
Name:Disintegrin and metalloproteinase domain-containing protein 10
Type:Enzyme
Mol. Mass.:84160.93
Organism:Homo sapiens (Human)
Description:O14672
Residue:748
BDBM50268954
NameBDBM50268954
Synonyms:(5S,6S)-N-hydroxy-6-(4-phenylpiperazine-1-carbonyl)spiro[2.5]octane-5-carboxamide | CHEMBL521719
TypeSmall organic molecule
Emp. Form.C20H27N3O3
Mol. Mass.357.4467
SMILESONC(=O)[C@H]1CC2(CC2)CC[C@@H]1C(=O)N1CCN(CC1)c1ccccc1