Reaction Details
Target72 kDa type IV collagenase
LigandBDBM50268952
Substrate/Competitorn/a
Meas. Tech.ChEMBL_523764 (CHEMBL1008372)
IC50 81±n/a nM
Citation Burns, DMLi, YLShi, EHe, CXu, MZhuo, JZhang, CQian, DQLi, YWynn, RCovington, MBKatiyar, KMarando, CAFridman, JSScherle, PFriedman, SMetcalf, BYao, W Compelling P1 substituent affect on metalloprotease binding profile enables the design of a novel cyclohexyl core scaffold with excellent MMP selectivity and HER-2 sheddase inhibition. Bioorg Med Chem Lett19:3525-30 (2009) 
 
72 kDa type IV collagenase
Name:72 kDa type IV collagenase
Type:Enzyme
Mol. Mass.:73870.36
Organism:Homo sapiens (Human)
Description: P08253
Residue:660
BDBM50268952
NameBDBM50268952
Synonyms:(2S,3S,5RS)-N-hydroxy-1-methyl-5-(2-oxo-2-(piperidin-1-yl)ethyl)-2-(4-phenylpiperazine-1-carbonyl)piperidine-3-carboxamide | CHEMBL496211
TypeSmall organic molecule
Emp. Form.C25H37N5O4
Mol. Mass.471.5924
SMILESCN1CC(CC(=O)N2CCCCC2)C[C@@H]([C@H]1C(=O)N1CCN(CC1)c1ccccc1)C(=O)NO