Reaction Details
TargetC-C chemokine receptor type 2
LigandBDBM50268426
Substrate/Competitorn/a
Meas. Tech.ChEMBL_523903 (CHEMBL1001496)
IC50 1.4±n/a nM
Citation Cherney, RJMo, RMeyer, DTVoss, MELo, YCYang, GMiller, PBScherle, PATebben, AJCarter, PHDecicco, CP Novel sulfone-containing di- and trisubstituted cyclohexanes as potent CC chemokine receptor 2 (CCR2) antagonists. Bioorg Med Chem Lett19:3418-22 (2009) 
 
C-C chemokine receptor type 2
Name:C-C chemokine receptor type 2
Type:Enzyme
Mol. Mass.:41932.32
Organism:Homo sapiens (Human)
Description:P41597
Residue:374
BDBM50268426
NameBDBM50268426
Synonyms:2-amino-N-(2-((1S,2R,4R)-4-(isopropyl(methyl)amino)-2-((4-(methylthio)phenylsulfonyl)methyl)cyclohexylamino)-2-oxoethyl)-5-(trifluoromethyl)benzamide | CHEMBL526752
TypeSmall organic molecule
Emp. Form.C28H37F3N4O4S2
Mol. Mass.614.743
SMILESCSc1ccc(cc1)S(=O)(=O)C[C@@H]1C[C@@H](CC[C@@H]1NC(=O)CNC(=O)c1cc(ccc1N)C(F)(F)F)N(C)C(C)C