Reaction Details
TargetExtracellular calcium-sensing receptor
LigandBDBM50268052
Substrate/Competitorn/a
Meas. Tech.ChEMBL_520033 (CHEMBL939872)
IC50 210±n/a nM
Citation Marquis, RWLago, AMCallahan, JFTrout, REGowen, MDelMar, EGVan Wagenen, BCLogan, SShimizu, SFox, JNemeth, EFYang, ZRoethke, TSmith, BRWard, KWLee, JKeenan, RMBhatnagar, P Antagonists of the calcium receptor I. Amino alcohol-based parathyroid hormone secretagogues. J Med Chem52:3982-93 (2009) 
 
Extracellular calcium-sensing receptor
Name:Extracellular calcium-sensing receptor
Type:Protein
Mol. Mass.:120663.13
Organism:Homo sapiens (Human)
Description:P41180
Residue:1078
BDBM50268052
NameBDBM50268052
Synonyms:(+/-)-1-([1,1-Dimethyl-2-(2-naphthalenyl)ethyl]amino)-3-(phenyloxy)-2-propanol | CHEMBL488736
TypeSmall organic molecule
Emp. Form.C23H27NO2
Mol. Mass.349.466
SMILESCC(C)(Cc1cccc2ccccc12)NCC(O)COc1ccccc1