Reaction Details
TargetExtracellular calcium-sensing receptor
LigandBDBM50268054
Substrate/Competitorn/a
Meas. Tech.ChEMBL_520033 (CHEMBL939872)
IC50 950±n/a nM
Citation Marquis, RWLago, AMCallahan, JFTrout, REGowen, MDelMar, EGVan Wagenen, BCLogan, SShimizu, SFox, JNemeth, EFYang, ZRoethke, TSmith, BRWard, KWLee, JKeenan, RMBhatnagar, P Antagonists of the calcium receptor I. Amino alcohol-based parathyroid hormone secretagogues. J Med Chem52:3982-93 (2009) 
 
Extracellular calcium-sensing receptor
Name:Extracellular calcium-sensing receptor
Type:Protein
Mol. Mass.:120663.13
Organism:Homo sapiens (Human)
Description:P41180
Residue:1078
BDBM50268054
NameBDBM50268054
Synonyms:(+/-)-[3-[(2,3-Dichlorophenyl)oxy]-2-(methyloxy)propyl](1,1-dimethyl-2-[4-(methyloxy)phenyl]ethyl)amine | CHEMBL488738
TypeSmall organic molecule
Emp. Form.C21H27Cl2NO3
Mol. Mass.412.35
SMILESCOC(CNC(C)(C)Cc1ccc(OC)cc1)COc1cccc(Cl)c1Cl