Reaction Details
TargetExtracellular calcium-sensing receptor
LigandBDBM50268029
Substrate/Competitorn/a
Meas. Tech.ChEMBL_520033 (CHEMBL939872)
IC50>10000±n/a nM
Citation Marquis, RWLago, AMCallahan, JFTrout, REGowen, MDelMar, EGVan Wagenen, BCLogan, SShimizu, SFox, JNemeth, EFYang, ZRoethke, TSmith, BRWard, KWLee, JKeenan, RMBhatnagar, P Antagonists of the calcium receptor I. Amino alcohol-based parathyroid hormone secretagogues. J Med Chem52:3982-93 (2009) 
 
Extracellular calcium-sensing receptor
Name:Extracellular calcium-sensing receptor
Type:Protein
Mol. Mass.:120663.13
Organism:Homo sapiens (Human)
Description:P41180
Residue:1078
BDBM50268029
NameBDBM50268029
Synonyms:(+/-)-1-((2-Methyl-2-[4-(methyloxy)phenyl]propyl)amino)-3-(phenyloxy)-2-propanol | CHEMBL519645
TypeSmall organic molecule
Emp. Form.C20H27NO3
Mol. Mass.329.4333
SMILESCOc1ccc(cc1)C(C)(C)CNCC(O)COc1ccccc1