Reaction Details
TargetCannabinoid receptor 2
LigandBDBM50279203
Substrate/Competitorn/a
Meas. Tech.ChEMBL_545296 (CHEMBL1020742)
IC50 3177.2±n/a nM
Citation Wu, CHHung, MSSong, JSYeh, TKChou, MCChu, CMJan, JJHsieh, MTTseng, SLChang, CPHsieh, WPLin, YYeh, YNChung, WLKuo, CWLin, CYShy, HSChao, YSShia, KS Discovery of 2-[5-(4-chloro-phenyl)-1-(2,4-dichloro-phenyl)-4-ethyl-1H-pyrazol-3-yl]-1,5,5-trimethyl-1,5-dihydro-imidazol-4-thione (BPR-890) via an active metabolite. A novel, potent and selective cannabinoid-1 receptor inverse agonist with high antiobesity efficacy in DIO mice. J Med Chem52:4496-510 (2009) 
 
Cannabinoid receptor 2
Name:Cannabinoid receptor 2
Type:G Protein-Coupled Receptor (GPCR)
Mol. Mass.:39690.94
Organism:Homo sapiens (Human)
Description:P34972
Residue:360
BDBM50279203
NameBDBM50279203
Synonyms:6-[5-(4-Chloro-phenyl)-1-(2,4-dichloro-phenyl)-4-ethyl-1H-pyrazol-3-yl]-5,7-diaza-spiro[3.4]oct-5-en-8-one | CHEMBL497913
TypeSmall organic molecule
Emp. Form.C23H19Cl3N4O
Mol. Mass.473.782
SMILESCCc1c(nn(c1-c1ccc(Cl)cc1)-c1ccc(Cl)cc1Cl)C1=NC2(CCC2)C(=O)N1