Reaction Details
TargetNeuronal acetylcholine receptor subunit alpha-4
LigandBDBM50279279
Substrate/Competitorn/a
Meas. Tech.ChEMBL_546015 (CHEMBL1028493)
Ki 2.6±n/a nM
Citation Tasso, BCanu Boido, CTerranova, EGotti, CRiganti, LClementi, FArtali, RBombieri, GMeneghetti, FSparatore, F Synthesis, binding, and modeling studies of new cytisine derivatives, as ligands for neuronal nicotinic acetylcholine receptor subtypes. J Med Chem52:4345-57 (2009) 
 
Neuronal acetylcholine receptor subunit alpha-4
Name:Neuronal acetylcholine receptor subunit alpha-4
Type:Enzyme
Mol. Mass.:70196.44
Organism:Rattus norvegicus (Rat)
Description:P09483
Residue:630
BDBM50279279
NameBDBM50279279
Synonyms:1-Phenyl-3-(cytisin-12-yl)-1-propanone | CHEMBL502030
TypeSmall organic molecule
Emp. Form.C20H22N2O2
Mol. Mass.322.4009
SMILESO=C(CCN1C[C@@H]2C[C@H](C1)c1cccc(=O)n1C2)c1ccccc1