Reaction Details
TargetNeuronal acetylcholine receptor subunit alpha-4
LigandBDBM50279277
Substrate/Competitorn/a
Meas. Tech.ChEMBL_546015 (CHEMBL1028493)
Ki 17±n/a nM
Citation Tasso, BCanu Boido, CTerranova, EGotti, CRiganti, LClementi, FArtali, RBombieri, GMeneghetti, FSparatore, F Synthesis, binding, and modeling studies of new cytisine derivatives, as ligands for neuronal nicotinic acetylcholine receptor subtypes. J Med Chem52:4345-57 (2009) 
 
Neuronal acetylcholine receptor subunit alpha-4
Name:Neuronal acetylcholine receptor subunit alpha-4
Type:Enzyme
Mol. Mass.:70196.44
Organism:Rattus norvegicus (Rat)
Description:P09483
Residue:630
BDBM50279277
NameBDBM50279277
Synonyms:1-Phenyl-2-(cytisin-12-yl)-1-ethanone | CHEMBL502029
TypeSmall organic molecule
Emp. Form.C19H20N2O2
Mol. Mass.308.3743
SMILESO=C(CN1C[C@@H]2C[C@H](C1)c1cccc(=O)n1C2)c1ccccc1