Reaction Details
TargetNeuronal acetylcholine receptor subunit alpha-4
LigandBDBM50279245
Substrate/Competitorn/a
Meas. Tech.ChEMBL_546015 (CHEMBL1028493)
Ki 744±n/a nM
Citation Tasso, BCanu Boido, CTerranova, EGotti, CRiganti, LClementi, FArtali, RBombieri, GMeneghetti, FSparatore, F Synthesis, binding, and modeling studies of new cytisine derivatives, as ligands for neuronal nicotinic acetylcholine receptor subtypes. J Med Chem52:4345-57 (2009) 
 
Neuronal acetylcholine receptor subunit alpha-4
Name:Neuronal acetylcholine receptor subunit alpha-4
Type:Enzyme
Mol. Mass.:70196.44
Organism:Rattus norvegicus (Rat)
Description:P09483
Residue:630
BDBM50279245
NameBDBM50279245
Synonyms:CHEMBL499635 | N-[3-(Pyridin-3-yl)propyl]cytisine
TypeSmall organic molecule
Emp. Form.C19H23N3O
Mol. Mass.309.4054
SMILESO=c1cccc2[C@@H]3C[C@@H](CN(CCCc4cccnc4)C3)Cn12