Reaction Details
TargetNeuronal acetylcholine receptor subunit alpha-7
LigandBDBM50279277
Substrate/Competitorn/a
Meas. Tech.ChEMBL_546016 (CHEMBL1028494)
Ki 2250±n/a nM
Citation Tasso, BCanu Boido, CTerranova, EGotti, CRiganti, LClementi, FArtali, RBombieri, GMeneghetti, FSparatore, F Synthesis, binding, and modeling studies of new cytisine derivatives, as ligands for neuronal nicotinic acetylcholine receptor subtypes. J Med Chem52:4345-57 (2009) 
 
Neuronal acetylcholine receptor subunit alpha-7
Name:Neuronal acetylcholine receptor subunit alpha-7
Type:Enzyme
Mol. Mass.:56502.44
Organism:Rattus norvegicus (Rat)
Description:Q05941
Residue:502
BDBM50279277
NameBDBM50279277
Synonyms:1-Phenyl-2-(cytisin-12-yl)-1-ethanone | CHEMBL502029
TypeSmall organic molecule
Emp. Form.C19H20N2O2
Mol. Mass.308.3743
SMILESO=C(CN1C[C@@H]2C[C@H](C1)c1cccc(=O)n1C2)c1ccccc1