Reaction Details
TargetNeutrophil elastase
LigandBDBM50036479
Substrate/Competitorn/a
Meas. Tech.ChEBML_64136
Ki 15±n/a nM
Citation Subramanyam, CBell, MR A general synthesis of 4-alkyl/aryl substituted saccharins Bioorg Med Chem Lett1:733-736 (1991)    Article
 
Neutrophil elastase
Name:Neutrophil elastase
Type:Enzyme
Mol. Mass.:28532.38
Organism:Homo sapiens (Human)
Description:P08246
Residue:267
BDBM50036479
NameBDBM50036479
Synonyms:1,1-Dioxo-2-(1-phenyl-1H-tetrazol-5-ylsulfanylmethyl)-1,2-dihydro-1lambda*6*-benzo[d]isothiazol-3-one | CHEMBL50803
TypeSmall organic molecule
Emp. Form.C15H11N5O3S2
Mol. Mass.373.41
SMILESO=C1N(CSc2nnnn2-c2ccccc2)S(=O)(=O)c2ccccc12