Reaction Details
TargetLysosomal acid glucosylceramidase
LigandBDBM50280029
Substrate/Competitorn/a
Meas. Tech.ChEMBL_218239 (CHEMBL823892)
pH5±n/a
Ki 42000±n/a nM
Commentsextracted
Citation Berger, ADax, KGradnig, GGrassberger, VStütz, AEUngerank, MLegler, GBause, E Synthesis and biological activity of C-6 modified derivatives of the glucosidase inhibitor 1-deoxynojirimycin. Bioorg Med Chem Lett2:27-32 (1992)    Article
 
Lysosomal acid glucosylceramidase
Name:Lysosomal acid glucosylceramidase
Type:Enzyme
Mol. Mass.:59724.64
Organism:Homo sapiens (Human)
Description:The beta-Glu activity was measured with commercially available beta-glucocerebrosidase (Ceredase) as the enzyme source.
Residue:536
BDBM50280029
NameBDBM50280029
Synonyms:(2R,3R,4R,5S)-2-(1-Hydroxy-propyl)-piperidine-3,4,5-triol | CHEMBL108656
TypeSmall organic molecule
Emp. Form.C8H17NO4
Mol. Mass.191.2249
SMILESCCC(O)[C@H]1NC[C@H](O)[C@@H](O)[C@@H]1O