Reaction Details
TargetNeutral alpha-glucosidase AB
LigandBDBM18351
Substrate/Competitorn/a
Meas. Tech.ChEMBL_218087 (CHEMBL822534)
pH6±n/a
Ki 14±n/a nM
Commentsextracted
Citation Berger, ADax, KGradnig, GGrassberger, VStütz, AEUngerank, MLegler, GBause, E Synthesis and biological activity of C-6 modified derivatives of the glucosidase inhibitor 1-deoxynojirimycin. Bioorg Med Chem Lett2:27-32 (1992)    Article
 
Neutral alpha-glucosidase AB
Name:Neutral alpha-glucosidase AB
Type:PROTEIN
Mol. Mass.:106864.62
Organism:Homo sapiens (Human)
Description:ChEMBL_218093
Residue:944
BDBM18351
NameBDBM18351
Synonyms:(2R,3R,4R,5S)-2-(Hydroxymethyl)piperidine-3,4,5-triol, 10 1-Deoxynojirimycin CHEMBL307429 US9181184, 1 | dNM
Typenatural product
Emp. Form.C6H13NO4
Mol. Mass.163.1717
SMILESOC[C@H]1NC[C@H](O)[C@@H](O)[C@@H]1O