Reaction Details
TargetNeutral alpha-glucosidase AB
LigandBDBM50280031
Substrate/Competitorn/a
Meas. Tech.ChEMBL_218086 (CHEMBL822533)
pH5±n/a
Ki 15±n/a nM
Commentsextracted
Citation Berger, ADax, KGradnig, GGrassberger, VStütz, AEUngerank, MLegler, GBause, E Synthesis and biological activity of C-6 modified derivatives of the glucosidase inhibitor 1-deoxynojirimycin. Bioorg Med Chem Lett2:27-32 (1992)    Article
 
Neutral alpha-glucosidase AB
Name:Neutral alpha-glucosidase AB
Type:PROTEIN
Mol. Mass.:106864.62
Organism:Homo sapiens (Human)
Description:ChEMBL_218093
Residue:944
BDBM50280031
NameBDBM50280031
Synonyms:(6S,7R,8R)-Octahydro-indolizine-1,6,7,8-tetraol | CHEMBL421040
TypeSmall organic molecule
Emp. Form.C8H15NO4
Mol. Mass.189.209
SMILESOC1CCN2C[C@H](O)[C@@H](O)[C@H](O)C12