Reaction Details
TargetNeutral alpha-glucosidase AB
LigandBDBM50280030
Substrate/Competitorn/a
Meas. Tech.ChEMBL_218092 (CHEMBL822539)
pH6±n/a
Ki 29000±n/a nM
Commentsextracted
Citation Berger, ADax, KGradnig, GGrassberger, VStütz, AEUngerank, MLegler, GBause, E Synthesis and biological activity of C-6 modified derivatives of the glucosidase inhibitor 1-deoxynojirimycin. Bioorg Med Chem Lett2:27-32 (1992)    Article
 
Neutral alpha-glucosidase AB
Name:Neutral alpha-glucosidase AB
Type:PROTEIN
Mol. Mass.:106864.62
Organism:Homo sapiens (Human)
Description:ChEMBL_218093
Residue:944
BDBM50280030
NameBDBM50280030
Synonyms:(2S,3R,4R,5S)-2-Fluoromethyl-piperidine-3,4,5-triol | CHEMBL111326
TypeSmall organic molecule
Emp. Form.C6H12FNO3
Mol. Mass.165.1628
SMILESO[C@H]1CN[C@H](CF)[C@@H](O)[C@@H]1O