Reaction Details
TargetLysosomal acid glucosylceramidase
LigandBDBM50280030
Substrate/Competitorn/a
Meas. Tech.ChEMBL_218239 (CHEMBL823892)
pH5±n/a
Ki 380000±n/a nM
Commentsextracted
Citation Berger, ADax, KGradnig, GGrassberger, VStütz, AEUngerank, MLegler, GBause, E Synthesis and biological activity of C-6 modified derivatives of the glucosidase inhibitor 1-deoxynojirimycin. Bioorg Med Chem Lett2:27-32 (1992)    Article
 
Lysosomal acid glucosylceramidase
Name:Lysosomal acid glucosylceramidase
Type:Enzyme
Mol. Mass.:59724.64
Organism:Homo sapiens (Human)
Description:The beta-Glu activity was measured with commercially available beta-glucocerebrosidase (Ceredase) as the enzyme source.
Residue:536
BDBM50280030
NameBDBM50280030
Synonyms:(2S,3R,4R,5S)-2-Fluoromethyl-piperidine-3,4,5-triol | CHEMBL111326
TypeSmall organic molecule
Emp. Form.C6H12FNO3
Mol. Mass.165.1628
SMILESO[C@H]1CN[C@H](CF)[C@@H](O)[C@@H]1O