Reaction Details
Target3-dehydroquinate synthase
LigandBDBM50280172
Substrate/Competitorn/a
Meas. Tech.ChEMBL_356 (CHEMBL615411)
Ki 5.4±n/a nM
Citation Montchamp, JLPiehler, LTTolbert, TJFront, JW The basis for slowly reversible inhibition of dehydroquinate synthase: a case of mistaken identity? Bioorg Med Chem Lett2:1349-1352 (1992)    Article
 
3-dehydroquinate synthase
Name:3-dehydroquinate synthase
Type:Enzyme
Mol. Mass.:38878.02
Organism:Escherichia coli (strain K12)
Description:P07639
Residue:362
BDBM50280172
NameBDBM50280172
Synonyms:1,3,4-Trihydroxy-5-phosphonomethyl-cyclohexanecarboxylic acid | CHEMBL281425
TypeSmall organic molecule
Emp. Form.C8H15O8P
Mol. Mass.270.1737
SMILESOC1CC(O)(CC(CP(O)(O)=O)C1O)C(O)=O