Reaction Details
TargetSeed linoleate 13S-lipoxygenase-1
LigandBDBM50280207
Substrate/Competitorn/a
Meas. Tech.ChEBML_101366
Ki>100000±n/a nM
Citation Wright, SWNelson, MJ Episulfide inhibitors of lipoxygenase Bioorg Med Chem Lett2:1385-1390 (1992)    Article
 
Seed linoleate 13S-lipoxygenase-1
Name:Seed linoleate 13S-lipoxygenase-1
Type:Enzyme
Mol. Mass.:94365.66
Organism:Glycine max (soybean)
Description:n/a
Residue:839
BDBM50280207
NameBDBM50280207
Synonyms:11-(3-Pentyl-oxiranyl)-undecanoic acid | CHEMBL281921
TypeSmall organic molecule
Emp. Form.C18H34O3
Mol. Mass.298.4608
SMILESCCCCCC1OC1CCCCCCCCCCC(O)=O