Reaction Details
TargetSeed linoleate 13S-lipoxygenase-1
LigandBDBM50280209
Substrate/Competitorn/a
Meas. Tech.ChEBML_101366
Ki>100000±n/a nM
Citation Wright, SWNelson, MJ Episulfide inhibitors of lipoxygenase Bioorg Med Chem Lett2:1385-1390 (1992)    Article
 
Seed linoleate 13S-lipoxygenase-1
Name:Seed linoleate 13S-lipoxygenase-1
Type:Enzyme
Mol. Mass.:94365.66
Organism:Glycine max (soybean)
Description:n/a
Residue:839
BDBM50280209
NameBDBM50280209
Synonyms:8-(3-Octyl-thiiranyl)-octanoic acid | CHEMBL28539
TypeSmall organic molecule
Emp. Form.C18H34O2S
Mol. Mass.314.526
SMILESCCCCCCCCC1SC1CCCCCCCC(O)=O