Reaction Details
TargetSeed linoleate 13S-lipoxygenase-1
LigandBDBM50280210
Substrate/Competitorn/a
Meas. Tech.ChEBML_101366
Ki>100000±n/a nM
Citation Wright, SWNelson, MJ Episulfide inhibitors of lipoxygenase Bioorg Med Chem Lett2:1385-1390 (1992)    Article
 
Seed linoleate 13S-lipoxygenase-1
Name:Seed linoleate 13S-lipoxygenase-1
Type:Enzyme
Mol. Mass.:94365.66
Organism:Glycine max (soybean)
Description:n/a
Residue:839
BDBM50280210
NameBDBM50280210
Synonyms:8-[((E)-3-Oct-2-enyl)-oxiranyl]-octanoic acid | CHEMBL28484
TypeSmall organic molecule
Emp. Form.C18H32O3
Mol. Mass.296.4449
SMILESCCCCC\C=C\CC1OC1CCCCCCCC(O)=O