Reaction Details
TargetSeed linoleate 13S-lipoxygenase-1
LigandBDBM50280211
Substrate/Competitorn/a
Meas. Tech.ChEBML_101366
Ki 4000±n/a nM
Citation Wright, SWNelson, MJ Episulfide inhibitors of lipoxygenase Bioorg Med Chem Lett2:1385-1390 (1992)    Article
 
Seed linoleate 13S-lipoxygenase-1
Name:Seed linoleate 13S-lipoxygenase-1
Type:Enzyme
Mol. Mass.:94365.66
Organism:Glycine max (soybean)
Description:n/a
Residue:839
BDBM50280211
NameBDBM50280211
Synonyms:11-(3-Pentyl-thiiranyl)-undecanoic acid | CHEMBL28901
TypeSmall organic molecule
Emp. Form.C18H34O2S
Mol. Mass.314.526
SMILESCCCCCC1SC1CCCCCCCCCCC(O)=O