Reaction Details
TargetSeed linoleate 13S-lipoxygenase-1
LigandBDBM50280212
Substrate/Competitorn/a
Meas. Tech.ChEBML_101366
Ki>100000±n/a nM
Citation Wright, SWNelson, MJ Episulfide inhibitors of lipoxygenase Bioorg Med Chem Lett2:1385-1390 (1992)    Article
 
Seed linoleate 13S-lipoxygenase-1
Name:Seed linoleate 13S-lipoxygenase-1
Type:Enzyme
Mol. Mass.:94365.66
Organism:Glycine max (soybean)
Description:n/a
Residue:839
BDBM50280212
NameBDBM50280212
Synonyms:8-[((E)-3-Oct-2-enyl)-thiiranyl]-octanoic acid | CHEMBL28925
TypeSmall organic molecule
Emp. Form.C18H32O2S
Mol. Mass.312.51
SMILESCCCCC\C=C\CC1SC1CCCCCCCC(O)=O