Reaction Details
TargetSeed linoleate 13S-lipoxygenase-1
LigandBDBM50280213
Substrate/Competitorn/a
Meas. Tech.ChEBML_101366
Ki 2000±n/a nM
Citation Wright, SWNelson, MJ Episulfide inhibitors of lipoxygenase Bioorg Med Chem Lett2:1385-1390 (1992)    Article
 
Seed linoleate 13S-lipoxygenase-1
Name:Seed linoleate 13S-lipoxygenase-1
Type:Enzyme
Mol. Mass.:94365.66
Organism:Glycine max (soybean)
Description:n/a
Residue:839
BDBM50280213
NameBDBM50280213
Synonyms:(E)-11-(3-Pentyl-thiiranyl)-undec-9-enoic acid | CHEMBL283482
TypeSmall organic molecule
Emp. Form.C18H32O2S
Mol. Mass.312.51
SMILESCCCCCC1SC1C\C=C\CCCCCCCC(O)=O