Reaction Details
TargetLeukotriene B4 receptor 1
LigandBDBM50280290
Substrate/Competitorn/a
Meas. Tech.ChEMBL_99517 (CHEMBL707241)
IC50 6±n/a nM
Citation Sofia, MJJackson, WTSaussyJr., DLSilbaugh, SAFroelich, LLCockerham, SLStengel, PW Ortho-alkoxyphenol leukotriene B4 receptor antagonists Bioorg Med Chem Lett2:1669-1674 (1992)    Article
 
Leukotriene B4 receptor 1
Name:Leukotriene B4 receptor 1
Type:Enzyme Catalytic Domain
Mol. Mass.:37582.68
Organism:Homo sapiens (Human)
Description:Q15722
Residue:352
BDBM50280290
NameBDBM50280290
Synonyms:4-ethyl-2-methoxy-5-[6-methyl-6-(2H-1,2,3,4-tetraazol-5-yl)heptyloxy]phenol; with sodium ion sodium 4-ethyl-2-methoxy-5-[6-methyl-6-(2H-1,2,3,4-tetraazol-5-yl)heptyloxy]phenol
TypeSmall organic molecule
Emp. Form.C18H27N4O3
Mol. Mass.347.4325
SMILESCCc1cc(OC)c(O)cc1OCCCCCC(C)(C)c1nn[n-]n1