Reaction Details
TargetLeukotriene B4 receptor 1
LigandBDBM50280287
Substrate/Competitorn/a
Meas. Tech.ChEBML_99517
IC50 12±n/a nM
Citation Sofia, MJJackson, WTSaussyJr., DLSilbaugh, SAFroelich, LLCockerham, SLStengel, PW Ortho-alkoxyphenol leukotriene B4 receptor antagonists Bioorg Med Chem Lett2:1669-1674 (1992)    Article
 
Leukotriene B4 receptor 1
Name:Leukotriene B4 receptor 1
Type:Enzyme Catalytic Domain
Mol. Mass.:37582.68
Organism:Homo sapiens (Human)
Description:Q15722
Residue:352
BDBM50280287
NameBDBM50280287
Synonyms:4-ethyl-2-isopropoxy-5-[6-methyl-6-(2H-1,2,3,4-tetraazol-5-yl)heptyloxy]phenol; with sodium ion | CHEMBL47716
TypeSmall organic molecule
Emp. Form.C20H31N4O3
Mol. Mass.375.4857
SMILESCCc1cc(OC(C)C)c(O)cc1OCCCCCC(C)(C)c1nn[n-]n1