Reaction Details
TargetLeukotriene B4 receptor 1
LigandBDBM50036749
Substrate/Competitorn/a
Meas. Tech.ChEMBL_99492 (CHEMBL704380)
Ki 78±n/a nM
Citation Sofia, MJJackson, WTSaussyJr., DLSilbaugh, SAFroelich, LLCockerham, SLStengel, PW Ortho-alkoxyphenol leukotriene B4 receptor antagonists Bioorg Med Chem Lett2:1669-1674 (1992)    Article
 
Leukotriene B4 receptor 1
Name:Leukotriene B4 receptor 1
Type:Enzyme Catalytic Domain
Mol. Mass.:37582.68
Organism:Homo sapiens (Human)
Description:Q15722
Residue:352
BDBM50036749
NameBDBM50036749
Synonyms:1-{5-ethyl-2-hydroxy-4-[6-methyl-6-(2H-1,2,3,4-tetraazol-5-yl)heptyloxy]phenyl}-1-ethanone; with sodium ion LY-255283 sodium 1-{5-ethyl-2-hydroxy-4-[6-methyl-6-(2H-1,2,3,4-tetraazol-5-yl)heptyloxy]phenyl}-1-ethanone
TypeSmall organic molecule
Emp. Form.C19H27N4O3
Mol. Mass.359.4432
SMILESCCc1cc(C(C)=O)c(O)cc1OCCCCCC(C)(C)c1nn[n-]n1