Reaction Details
Target5-hydroxytryptamine receptor 1A
LigandBDBM50005127
Substrate/Competitorn/a
Meas. Tech.ChEBML_1066
Ki 12±n/a nM
Citation Romero, AGDarlington, WHPiercey, MFLahti, RA Synthesis of metabolically stable arylpiperazine 5-HT1A receptor agonists Bioorg Med Chem Lett2:1703-1706 (1992)    Article
 
5-hydroxytryptamine receptor 1A
Name:5-hydroxytryptamine receptor 1A
Type:Enzyme
Mol. Mass.:46192.09
Organism:Mus musculus (Mouse)
Description:Q64264
Residue:421
BDBM50005127
NameBDBM50005127
Synonyms:1,1-Dioxo-2-[4-(4-pyrimidin-2-yl-piperazin-1-yl)-butyl]-1,2-dihydro-1lambda*6*-benzo[d]isothiazol-3-one 1,1-Dioxo-2-[4-(4-pyrimidin-2-yl-piperazin-1-yl)-butyl]-1,2-dihydro-1lambda*6*-benzo[d]isothiazol-3-one(Ipsapirone) IPSAPIRONE
TypeSmall organic molecule
Emp. Form.C19H23N5O3S
Mol. Mass.401.483
SMILESO=C1N(CCCCN2CCN(CC2)c2ncccn2)S(=O)(=O)c2ccccc12