Reaction Details
TargetLanosterol 14-alpha demethylase
LigandBDBM50280427
Substrate/Competitorn/a
Meas. Tech.ChEBML_218337
Kd 25000±n/a nM
Citation Wright, GDHonek, JF Synthesis and evaluation of photoaffinity probes directed at lanosterol 14α-demethylase (P-45014DMBioorg Med Chem Lett2:383-386 (1992)    Article
 
Lanosterol 14-alpha demethylase
Name:Lanosterol 14-alpha demethylase
Type:Protein
Mol. Mass.:56817.21
Organism:Homo sapiens (Human)
Description:Q16850
Residue:509
BDBM50280427
NameBDBM50280427
Synonyms:1-(4-Azido-phenyl)-1H-imidazole | CHEMBL127685
TypeSmall organic molecule
Emp. Form.C9H7N5
Mol. Mass.185.1854
SMILES[N-]=[N+]=Nc1ccc(cc1)-n1ccnc1