Reaction Details
TargetRenin
LigandBDBM50280492
Substrate/Competitorn/a
Meas. Tech.ChEBML_195763
IC50 40000±n/a nM
Citation Schirlin, DTarnus, CBaltzer, SRémy, JM MDL 74147, a novel selective and soluble inhibitor of human renin. Synthesis, structure-activity relationship, species and protease selectivities. Bioorg Med Chem Lett2:651-654 (1992)    Article
 
Renin
Name:Renin
Type:Enzyme
Mol. Mass.:45058.99
Organism:Homo sapiens (Human)
Description:n/a
Residue:406
BDBM50280492
NameBDBM50280492
Synonyms:(S)-2-{[(S)-3-(4-Methoxy-phenyl)-2-(3-methyl-butyrylamino)-propionyl]-methyl-amino}-pentanoic acid ((S)-4-amino-1-cyclohexylmethyl-3,3-difluoro-2-oxo-butyl)-amide; hydrochloride | CHEMBL545115
TypeSmall organic molecule
Emp. Form.C32H50F2N4O5
Mol. Mass.608.76
SMILESCCC[C@H](N(C)C(=O)[C@H](Cc1ccc(OC)cc1)NC(=O)CC(C)C)C(=O)N[C@@H](CC1CCCCC1)C(=O)C(F)(F)CN