Reaction Details
TargetRenin
LigandBDBM50280494
Substrate/Competitorn/a
Meas. Tech.ChEBML_195763
IC50 27000±n/a nM
Citation Schirlin, DTarnus, CBaltzer, SRémy, JM MDL 74147, a novel selective and soluble inhibitor of human renin. Synthesis, structure-activity relationship, species and protease selectivities. Bioorg Med Chem Lett2:651-654 (1992)    Article
 
Renin
Name:Renin
Type:Enzyme
Mol. Mass.:45058.99
Organism:Homo sapiens (Human)
Description:n/a
Residue:406
BDBM50280494
NameBDBM50280494
Synonyms:CHEMBL545117 | N-[(S)-1-[(R)-1-((S)-4-Amino-1-cyclohexylmethyl-3,3-difluoro-2-oxo-butylcarbamoyl)-ethylcarbamoyl]-2-(4-methoxy-phenyl)-ethyl]-3-methyl-butyramide; hydrochloride
TypeSmall organic molecule
Emp. Form.C29H44F2N4O5
Mol. Mass.566.6803
SMILESCOc1ccc(C[C@H](NC(=O)CC(C)C)C(=O)N[C@H](C)C(=O)N[C@@H](CC2CCCCC2)C(=O)C(F)(F)CN)cc1