Reaction Details
TargetMuscarinic acetylcholine receptor M1
LigandBDBM50004665
Substrate/Competitorn/a
Meas. Tech.ChEBML_139204
IC50 364±n/a nM
Citation Sanders, KBThomas, AJPavia, MRDavis, RECoughenour, LLMyers, SLFisher, SMoos, WH Cholinergic agents: aldehyde, ketone, and oxime analogues of the muscarinic agonist UH5 Bioorg Med Chem Lett2:803-808 (1992)    Article
 
Muscarinic acetylcholine receptor M1
Name:Muscarinic acetylcholine receptor M1
Type:Protein
Mol. Mass.:51442.54
Organism:Homo sapiens (Human)
Description:P11229
Residue:460
BDBM50004665
NameBDBM50004665
Synonyms:(oxotremorine)1-(4-Pyrrolidin-1-yl-but-2-ynyl)-pyrrolidin-2-one 1-(4-Pyrrolidin-1-yl-but-2-ynyl)-pyrrolidin-2-one (oxotremorphine) 1-[4-(2-oxo-pyrrolidin-1-yl)-but-2-ynyl]-pyrrolidinium Oxotremorine cid_4630
TypeSmall organic molecule
Emp. Form.C12H18N2O
Mol. Mass.206.2841
SMILESO=C1CCCN1CC#CCN1CCCC1