Reaction Details
TargetMuscarinic acetylcholine receptor M1
LigandBDBM50009291
Substrate/Competitorn/a
Meas. Tech.ChEBML_139204
IC50 87880±n/a nM
Citation Sanders, KBThomas, AJPavia, MRDavis, RECoughenour, LLMyers, SLFisher, SMoos, WH Cholinergic agents: aldehyde, ketone, and oxime analogues of the muscarinic agonist UH5 Bioorg Med Chem Lett2:803-808 (1992)    Article
 
Muscarinic acetylcholine receptor M1
Name:Muscarinic acetylcholine receptor M1
Type:Protein
Mol. Mass.:51442.54
Organism:Homo sapiens (Human)
Description:P11229
Residue:460
BDBM50009291
NameBDBM50009291
Synonyms:CHEMBL75358 | N-(4-Dimethylamino-but-2-ynyl)-N-methyl-acetamide
TypeSmall organic molecule
Emp. Form.C9H16N2O
Mol. Mass.168.2361
SMILESCN(C)CC#CCN(C)C(C)=O