Reaction Details
TargetMuscarinic acetylcholine receptor M2
LigandBDBM50065205
Substrate/Competitorn/a
Meas. Tech.ChEBML_139630
IC50 2840±n/a nM
Citation Tecle, HMirzadegan, TMoos, WHMoreland, DWPavia, MRSchwarz, RDDavis, RE A rationale for the design and synthesis of m1 selective muscarinic agonists. Bioorg Med Chem Lett2:821-826 (1992)    Article
 
Muscarinic acetylcholine receptor M2
Name:Muscarinic acetylcholine receptor M2
Type:GPCR
Mol. Mass.:51730.61
Organism:Homo sapiens (Human)
Description:P08172
Residue:466
BDBM50065205
NameBDBM50065205
Synonyms:1-Aza-bicyclo[2.2.1]heptan-3-one O-hexa-2,5-diynyl-oxime | CHEMBL313918
TypeSmall organic molecule
Emp. Form.C12H14N2O
Mol. Mass.202.2524
SMILESC#CCC#CCO\N=C1/CN2CCC1C2