Reaction Details
TargetCoagulation factor X
LigandBDBM50280654
Substrate/Competitorn/a
Meas. Tech.ChEBML_69536
IC50 2200±n/a nM
Citation Sall, DJBerry, DRCoffman, WJCraft, TJDenney, MLGifford-Moore, DSKellam, MLSmith, GF Characterization of LY806303 as a potent and selective inhibitor of thrombin Bioorg Med Chem Lett2:1025-1028 (1992)    Article
 
Coagulation factor X
Name:Coagulation factor X
Type:PROTEIN
Mol. Mass.:54498.45
Organism:Bos taurus
Description:ChEMBL_1364435
Residue:492
BDBM50280654
NameBDBM50280654
Synonyms:(S)-5-Guanidino-2-{[(S)-1-((S)-2-methylamino-2-phenyl-acetyl)-pyrrolidine-2-carbonyl]-amino}-pentanoic acid | CHEMBL8108
TypeSmall organic molecule
Emp. Form.C20H30N6O4
Mol. Mass.418.49
SMILESCN[C@H](C(=O)N1CCC[C@H]1C(=O)N[C@@H](CCCNC(N)=N)C(O)=O)c1ccccc1