Reaction Details
TargetMyosin light chain kinase, smooth muscle
LigandBDBM50280875
Substrate/Competitorn/a
Meas. Tech.ChEBML_161608
IC50 82±n/a nM
Citation Kleinschroth, JHartenstein, JRudolph, CSchächtele, C Non-glycosidic/non-aminoalkyl-substituted indolocarbazoles as inhibitors of protein kinase C Bioorg Med Chem Lett3:1959-1964 (1993)    Article
 
Myosin light chain kinase, smooth muscle
Name:Myosin light chain kinase, smooth muscle
Type:Enzyme
Mol. Mass.:210423.57
Organism:Gallus gallus (chicken)
Description:n/a
Residue:1906
BDBM50280875
NameBDBM50280875
Synonyms:3-(5-oxo-6,7,12,13-tetrahydro-5H-indolo[2,3-a]pyrrolo[3,4-c]carbazol-12-yl)propanamide | CHEMBL59384
TypeSmall organic molecule
Emp. Form.C23H18N4O2
Mol. Mass.382.4146
SMILESNC(=O)CCn1c2ccccc2c2c3CNC(=O)c3c3c4ccccc4[nH]c3c12