Reaction Details
TargetProtein kinase C alpha/beta/delta/epsilon/eta/gamma/theta/zeta type
LigandBDBM3033
Substrate/Competitorn/a
Meas. Tech.ChEMBL_162388 (CHEMBL767476)
IC50 20±n/a nM
Citation Kleinschroth, JHartenstein, JRudolph, CSchächtele, C Non-glycosidic/non-aminoalkyl-substituted indolocarbazoles as inhibitors of protein kinase C Bioorg Med Chem Lett3:1959-1964 (1993)    Article
 
Protein kinase C alpha/beta/delta/epsilon/eta/gamma/theta/zeta type
Name:Protein kinase C alpha/beta/delta/epsilon/eta/gamma/theta/zeta type
Synonyms:Protein kinase C (PKC)
Type:n/a
Mol. Mass.:n/a
Description:ASSAY_ID of ChEMBL is 162388
Components:This complex has 8 components.
Component 1
Name:Protein kinase C delta type
Type:PROTEIN
Mol. Mass.:77531.57
Organism:Rattus norvegicus
Description:ChEMBL_104731
Residue:673
Component 2
Name:Protein kinase C eta type
Synonyms:KPCL_RAT Pkch Protein kinase C eta type | nPKC-eta
Type:PROTEIN
Mol. Mass.:77961.39
Organism:Rattus norvegicus
Description:ChEMBL_104731
Residue:683
Component 3
Name:Protein kinase C theta type
Synonyms:KPCT_RAT Prkcq nPKC-theta
Type:PROTEIN
Mol. Mass.:81765.17
Organism:Rattus norvegicus
Description:ChEMBL_104731
Residue:707
Component 4
Name:Protein kinase C alpha type
Synonyms:KPCA_RAT Prkca Protein kinase C alpha | Protein kinase C alpha type
Type:Protein
Mol. Mass.:76797.67
Organism:Rattus norvegicus (Rat)
Description:P05696
Residue:672
Component 5
Name:Protein kinase C gamma type
Synonyms:KPCG_RAT Pkcg Prkcg Protein kinase C gamma
Type:PROTEIN
Mol. Mass.:78367.88
Organism:Rattus norvegicus
Description:ChEMBL_152979
Residue:697
Component 6
Name:Protein kinase C zeta type
Synonyms:KPCZ_RAT Prkcz Protein kinase C zeta type | nPKC-zeta
Type:PROTEIN
Mol. Mass.:67722.31
Organism:Rattus norvegicus
Description:ChEMBL_104731
Residue:592
Component 7
Name:Protein kinase C epsilon type
Synonyms:KPCE_RAT Prkce Protein kinase C epsilon nPKC-epsilon
Type:PROTEIN
Mol. Mass.:83483.06
Organism:Rattus norvegicus
Description:ChEMBL_160964
Residue:737
Component 8
Name:Protein kinase C beta type
Synonyms:KPCB_RAT Pkcb Prkcb1 Protein kinase C (PKC) | Protein kinase C beta
Type:Enzyme Mixture
Mol. Mass.:76755.54
Organism:Rattus norvegicus (rat)
Description:PKC from rat brain is known to contain predominately the conventional PKC isoforms, alpha, beta I, beta II, gamma.
Residue:671
BDBM3033
NameBDBM3033
Synonyms:3-{23-methyl-14-oxo-3,13,23-triazahexacyclo[14.7.0.0^{2,10}.0^{4,9}.0^{11,15}.0^{17,22}]tricosa-1(16),2(10),4(9),5,7,11(15),17,19,21-nonaen-3-yl}propanenitrile Go 6976 | Indolocarbazole deriv.
TypeSmall organic molecule
Emp. Form.C24H18N4O
Mol. Mass.378.4259
SMILESCn1c2ccccc2c2c3C(=O)NCc3c3c4ccccc4n(CCC#N)c3c12