Reaction Details
TargetAcetylcholinesterase
LigandBDBM50281127
Substrate/Competitorn/a
Meas. Tech.ChEBML_27804
Ki 0.008500±n/a nM
Citation Nair, HKQuinn, DM m-Alkyl, α,α,α-trifluoroacetophenones: A new class of potent transition state analog inhibitors of acetylcholinesterase Bioorg Med Chem Lett3:2619-2622 (1993)    Article
 
Acetylcholinesterase
Name:Acetylcholinesterase
Type:n/a
Mol. Mass.:65900.74
Organism:Tetronarce californica (Pacific electric ray) (Torpedo californica)
Description:P04058
Residue:586
BDBM50281127
NameBDBM50281127
Synonyms:2,2,2-Trifluoro-1-(3-isopropyl-phenyl)-ethanone | CHEMBL87098
TypeSmall organic molecule
Emp. Form.C11H11F3O
Mol. Mass.216.1996
SMILESCC(C)c1cccc(c1)C(=O)C(F)(F)F