Reaction Details
TargetAdenosine receptor A1
LigandBDBM50080400
Substrate/Competitorn/a
Meas. Tech.ChEBML_29639
Ki 4.2±n/a nM
Citation Knutsen, LJLau, JSheardown, MJThomsen, C The synthesis and biochemical evaluation of new A1 selective adenosine receptor agonists containing 6-hydrazinopurine moieties Bioorg Med Chem Lett3:2661-2666 (1993)    Article
 
Adenosine receptor A1
Name:Adenosine receptor A1
Type:Protein
Mol. Mass.:36704.13
Organism:Rattus norvegicus (rat)
Description:n/a
Residue:326
BDBM50080400
NameBDBM50080400
Synonyms:(2R,3R,4S,5R)-2-[2-Chloro-6-(piperidin-1-ylamino)-purin-9-yl]-5-hydroxymethyl-tetrahydro-furan-3,4-diol | CHEMBL423315
TypeSmall organic molecule
Emp. Form.C15H21ClN6O4
Mol. Mass.384.818
SMILESOC[C@H]1O[C@H]([C@H](O)[C@@H]1O)n1cnc2c(NN3CCCCC3)nc(Cl)nc12