Reaction Details
TargetGag-Pol polyprotein [489-587]
LigandBDBM50281324
Substrate/Competitorn/a
Meas. Tech.ChEBML_159776
pH6±n/a
IC50 10±n/a nM
Commentsextracted
Citation Fässler, ARösel, JGrüther, MTintelnot-Blomley, MAtteri, EBold, GLang, M Novel pseudosymmetric inhibitors of HIV-1 protease Bioorg Med Chem Lett3:2837-2842 (1993)    Article
 
Gag-Pol polyprotein [489-587]
Name:Gag-Pol polyprotein [489-587]
Type:Enzyme Subunit
Mol. Mass.:10781.16
Organism:Human immunodeficiency virus type 1
Description:P04585[489-587]
Residue:99
BDBM50281324
NameBDBM50281324
Synonyms:((S)-1-{N'-[(2S,3S)-3-((S)-2-Benzyloxycarbonylamino-3-methyl-butyrylamino)-2-hydroxy-4-phenyl-butyl]-N'-isobutyl-hydrazinocarbonyl}-2-methyl-propyl)-carbamic acid benzyl ester | CHEMBL317204
TypeSmall organic molecule
Emp. Form.C40H55N5O7
Mol. Mass.717.894
SMILESCC(C)CN(C[C@H](O)[C@H](Cc1ccccc1)NC(=O)[C@@H](NC(=O)OCc1ccccc1)C(C)C)NC(=O)[C@@H](NC(=O)OCc1ccccc1)C(C)C