Reaction Details
TargetGag-Pol polyprotein [489-587]
LigandBDBM50281480
Substrate/Competitorn/a
Meas. Tech.ChEBML_79957
Ki 650±n/a nM
Citation Schirlin, DBaltzer, SDorsselaer, VVWeber, FWeill, CAltenburger, JMNeises, BFlynn, GRémy, JMTarnus, C Short and unexpectedly potent difluorostatone type inhibitors of HIV-1 protease Bioorg Med Chem Lett3:253-258 (1993)    Article
 
Gag-Pol polyprotein [489-587]
Name:Gag-Pol polyprotein [489-587]
Type:Enzyme Subunit
Mol. Mass.:10781.16
Organism:Human immunodeficiency virus type 1
Description:P04585[489-587]
Residue:99
BDBM50281480
NameBDBM50281480
Synonyms:CHEMBL87473 | [1-Benzyl-3-(2,2-dimethyl-propylcarbamoyl)-3,3-difluoro-2-oxo-propyl]-carbamic acid benzyl ester
TypeSmall organic molecule
Emp. Form.C24H28F2N2O4
Mol. Mass.446.4869
SMILESCC(C)(C)CNC(=O)C(F)(F)C(=O)C(Cc1ccccc1)NC(=O)OCc1ccccc1