Reaction Details
TargetAmiloride-sensitive amine oxidase [copper-containing]
LigandBDBM50281517
Substrate/Competitorn/a
Meas. Tech.ChEBML_53890
Ki 1700±n/a nM
Citation Griffith, RKDiPietro, RA Synthesis of 4(5)-imidazolyl allylamines and propargylamines as inhibitors of diamine oxidase Bioorg Med Chem Lett3:353-356 (1993)    Article
 
Amiloride-sensitive amine oxidase [copper-containing]
Name:Amiloride-sensitive amine oxidase [copper-containing]
Type:Protein
Mol. Mass.:85387.64
Organism:Homo sapiens (Human)
Description:P19801
Residue:751
BDBM50281517
NameBDBM50281517
Synonyms:3-(1H-Imidazol-4-yl)-prop-2-ynylamine | CHEMBL116536
TypeSmall organic molecule
Emp. Form.C6H7N3
Mol. Mass.121.1399
SMILESNCC#Cc1cnc[nH]1